| Bienvenido, Invitado |
Tienes que registrarte para poder participar en nuestro foro.
|
|
|
| Problemas al montar mks servo 42b |
|
Enviado por: trupe - 10-07-2020, 04:40 PM - Foro: General
- Respuestas (1)
|
 |
Buenas, e montado en eje X e Y mks servo 42b en una placa mks sgen l y tengo un problema que al hacer homing o calibrado de cama se queda como si la cama fuese más pequeña.
Solo cuando reinicio y muevo los ejes uno por uno si llegan de un extremo a otro, pero si los llevo al extremo contrario del final de carrera y hago homing no llegan al final de carrera y se quedan bloqueados y ya no los puedo mover.
Alguien sabría qué es lo que falla?, gracias de antemano.
|
|
|
|
DICHOSA MKS ROBIN E3 PARA ENDER3/ENDER3PRO |
|
Enviado por: br0nka2 - 10-07-2020, 11:31 AM - Foro: Electrónica
- Respuestas (12)
|
 |
hola
estoy intentando instalar una mks robin e3 en mi ender3 pero no hay manera
Tengo un extrusor e3d v6 y un bondtech originales ambos, y tengo que modificar marlin para este menester
Me he descargado la versión de marlin del github de MKS y al compilar, SIEMPRE TENGO MISMO ERROR
Cita:In file included from Marlin\src\HAL\HAL_STM32F1\dogm\../../../inc/../HAL/./HAL_STM32F1/HAL.h:36,
from Marlin\src\HAL\HAL_STM32F1\dogm\../../../inc/../HAL/HAL.h:26,
from Marlin\src\HAL\HAL_STM32F1\dogm\../../../inc/MarlinConfig.h:30,
from Marlin\src\HAL\HAL_STM32F1\dogm\u8g_com_stm32duino_fsmc.cpp:29:
Marlin\src\HAL\HAL_STM32F1\dogm\../../../inc/../HAL/./HAL_STM32F1/fastio.h:30:10: fatal error: libmaple/gpio.h: No such file or directory
30 | #include <libmaple/gpio.h>
| ^~~~~~~~~~~~~~~~~
compilation terminated.
In file included from Marlin\src\HAL\HAL_STM32F1\../../inc/../HAL/./HAL_STM32F1/HAL.h:36,
from Marlin\src\HAL\HAL_STM32F1\../../inc/../HAL/HAL.h:26,
from Marlin\src\HAL\HAL_STM32F1\../../inc/MarlinConfig.h:30,
from Marlin\src\HAL\HAL_STM32F1\onboard_sd.cpp:15:
Marlin\src\HAL\HAL_STM32F1\../../inc/../HAL/./HAL_STM32F1/fastio.h:30:10: fatal error: libmaple/gpio.h: No such file or directory
30 | #include <libmaple/gpio.h>
| ^~~~~~~~~~~~~~~~~
compilation terminated.
Compiling .pio\build\mks_robin_e3\src\src\Marlin.cpp.o
Compiling .pio\build\mks_robin_e3\src\src\core\multi_language.cpp.o
Compiling .pio\build\mks_robin_e3\src\src\core\serial.cpp.o
*** [.pio\build\mks_robin_e3\src\src\HAL\HAL_STM32F1\dogm\u8g_com_stm32duino_fsmc.cpp.o] Error 1
*** [.pio\build\mks_robin_e3\src\src\HAL\HAL_STM32F1\onboard_sd.cpp.o] Error 1
In file included from Marlin\src\HAL\shared\../../inc/../HAL/./HAL_STM32F1/HAL.h:36,
from Marlin\src\HAL\shared\../../inc/../HAL/HAL.h:26,
from Marlin\src\HAL\shared\../../inc/MarlinConfig.h:30,
from Marlin\src\HAL\shared\HAL_spi_L6470.cpp:28:
Marlin\src\HAL\shared\../../inc/../HAL/./HAL_STM32F1/fastio.h:30:10: fatal error: libmaple/gpio.h: No such file or directory
30 | #include <libmaple/gpio.h>
| ^~~~~~~~~~~~~~~~~
compilation terminated.
*** [.pio\build\mks_robin_e3\src\src\HAL\shared\HAL_spi_L6470.cpp.o] Error 1
In file included from Marlin\src\HAL\shared\backtrace\../../../core/../inc/../HAL/./HAL_STM32F1/HAL.h:36,
from Marlin\src\HAL\shared\backtrace\../../../core/../inc/../HAL/HAL.h:26,
from Marlin\src\HAL\shared\backtrace\../../../core/../inc/MarlinConfig.h:30,
from Marlin\src\HAL\shared\backtrace\../../../core/serial.h:24,
from Marlin\src\HAL\shared\backtrace\backtrace.cpp:29:
Marlin\src\HAL\shared\backtrace\../../../core/../inc/../HAL/./HAL_STM32F1/fastio.h:30:10: fatal error: libmaple/gpio.h: No such file or directory
30 | #include <libmaple/gpio.h>
| ^~~~~~~~~~~~~~~~~
compilation terminated.
*** [.pio\build\mks_robin_e3\src\src\HAL\shared\backtrace\backtrace.cpp.o] Error 1
In file included from Marlin\src\HAL\shared\backtrace\../../../inc/../HAL/./HAL_STM32F1/HAL.h:36,
from Marlin\src\HAL\shared\backtrace\../../../inc/../HAL/HAL.h:26,
from Marlin\src\HAL\shared\backtrace\../../../inc/MarlinConfig.h:30,
from Marlin\src\HAL\shared\backtrace\unwmemaccess.cpp:18:
Marlin\src\HAL\shared\backtrace\../../../inc/../HAL/./HAL_STM32F1/fastio.h:30:10: fatal error: libmaple/gpio.h: No such file or directory
30 | #include <libmaple/gpio.h>
| ^~~~~~~~~~~~~~~~~
compilation terminated.
*** [.pio\build\mks_robin_e3\src\src\HAL\shared\backtrace\unwmemaccess.cpp.o] Error 1
In file included from Marlin\src\HAL\shared\../../inc/../HAL/./HAL_STM32F1/HAL.h:36,
from Marlin\src\HAL\shared\../../inc/../HAL/HAL.h:26,
from Marlin\src\HAL\shared\../../inc/MarlinConfig.h:30,
from Marlin\src\HAL\shared\eeprom_i2c.cpp:28:
Marlin\src\HAL\shared\../../inc/../HAL/./HAL_STM32F1/fastio.h:30:10: fatal error: libmaple/gpio.h: No such file or directory
30 | #include <libmaple/gpio.h>
| ^~~~~~~~~~~~~~~~~
compilation terminated.
*** [.pio\build\mks_robin_e3\src\src\HAL\shared\eeprom_i2c.cpp.o] Error 1
In file included from Marlin\src\HAL\shared\../../inc/../HAL/./HAL_STM32F1/HAL.h:36,
from Marlin\src\HAL\shared\../../inc/../HAL/HAL.h:26,
from Marlin\src\HAL\shared\../../inc/MarlinConfig.h:30,
from Marlin\src\HAL\shared\eeprom_spi.cpp:28:
Marlin\src\HAL\shared\../../inc/../HAL/./HAL_STM32F1/fastio.h:30:10: fatal error: libmaple/gpio.h: No such file or directory
30 | #include <libmaple/gpio.h>
| ^~~~~~~~~~~~~~~~~
compilation terminated.
*** [.pio\build\mks_robin_e3\src\src\HAL\shared\eeprom_spi.cpp.o] Error 1
In file included from Marlin\src\HAL\shared\../../inc/../HAL/./HAL_STM32F1/HAL.h:36,
from Marlin\src\HAL\shared\../../inc/../HAL/HAL.h:26,
from Marlin\src\HAL\shared\../../inc/MarlinConfig.h:30,
from Marlin\src\HAL\shared\servo.cpp:54:
Marlin\src\HAL\shared\../../inc/../HAL/./HAL_STM32F1/fastio.h:30:10: fatal error: libmaple/gpio.h: No such file or directory
30 | #include <libmaple/gpio.h>
| ^~~~~~~~~~~~~~~~~
compilation terminated.
*** [.pio\build\mks_robin_e3\src\src\HAL\shared\servo.cpp.o] Error 1
In file included from Marlin\src\inc/../HAL/./HAL_STM32F1/HAL.h:36,
from Marlin\src\inc/../HAL/HAL.h:26,
from Marlin\src\inc/MarlinConfig.h:30,
from Marlin\src\Marlin.h:24,
from Marlin\src\Marlin.cpp:31:
Marlin\src\inc/../HAL/./HAL_STM32F1/fastio.h:30:10: fatal error: libmaple/gpio.h: No such file or directory
30 | #include <libmaple/gpio.h>
| ^~~~~~~~~~~~~~~~~
compilation terminated.
*** [.pio\build\mks_robin_e3\src\src\Marlin.cpp.o] Error 1
In file included from Marlin\src\core\../inc/../HAL/./HAL_STM32F1/HAL.h:36,
from Marlin\src\core\../inc/../HAL/HAL.h:26,
from Marlin\src\core\../inc/MarlinConfig.h:30,
from Marlin\src\core\serial.h:24,
from Marlin\src\core\serial.cpp:23:
Marlin\src\core\../inc/../HAL/./HAL_STM32F1/fastio.h:30:10: fatal error: libmaple/gpio.h: No such file or directory
30 | #include <libmaple/gpio.h>
| ^~~~~~~~~~~~~~~~~
compilation terminated.
*** [.pio\build\mks_robin_e3\src\src\core\serial.cpp.o] Error 1
El otro problema que veo, es que al bajar versiones mas recientes de marlin (he probado 2.0.2, 2.0.3 y 2.0.5 y en el boards.h no aparece la mks robin e3 !!!
Por cierto, si pongo un marlin precompilado del github de MKS y flasheo, va todo bien y la impresora funciona como debe
Si compilo el bugfix de marlin, el proceso de actualización lo hace en la impresora, pero se queda "bloqueado" en el 100% y no muestra la pantalla de marlin instalado en el LCD de la ender3pro
Es desesperante
Alguien me puede ayudar por favor?
Gracias de antemano por vuestro tiempo
|
|
|
|
| problemas con mi prusa i3 pro b |
|
Enviado por: Juliancastillo - 10-07-2020, 05:02 AM - Foro: General - Invitados
- Sin respuestas
|
 |
buenas noches
tengo una impresora 3d prusa i3 pro b después de 3 años me esta presentando los siguientes;
1. se detiene cuando esta imprimiendo y la pantalla indica los grados en ceros y comienzan a bajar la temperatura del nozzle y la cama
2. se reinicia la pantalla led y queda igual en ceros los grado y bajando las temperaturas
3. se apaga mientras estar imprimiendo y luego se vuelve a prender
4. donde conecta la corriente a la tarjeta gt2560 se encienden dos led verdes y donde conecta el cable usb un led verde encima de esta
en la imagen adjunto con lineas rojas donde aparecen encendidos los led no se si muestra falla o algo
|
|
|
|
| Mesmixer |
|
Enviado por: Alice - 09-07-2020, 04:55 PM - Foro: Firmware y Software
- Respuestas (1)
|
 |
Buenas.
Suelo utilizar Meshmixer para realizar el vaciado, soportes, etc. en las piezas que luego imprimo con la anycubic photon, pero la mayoría de las veces se me cuelga porque le cuesta mucho cargar las piezas. Utilizo varios softwares de diseño asistido, etc. y ninguno me da problemas nunca. ¿a alguien le ha ocurrido esto mismo? ¿me recomendais algún otro software para este tipo de cosas, principalmente: vaciado y generación de soportes?
Gracias
|
|
|
|
| Codigo de error T_88 |
|
Enviado por: Alice - 09-07-2020, 04:35 PM - Foro: Anycubic
- Sin respuestas
|
 |
Buenas tardes.
LLevo un año con esta impresora y nunca me había dado problemas de código. Ahora cada vez que intento imprimir me da el error de código T_88. He investigado y parece que es problema señal LCD y me dice que reinicie pero eso no resuelve nada. También he visto que puede ser problema del conector USB, lo he formateado e incluso he utilizado otro y sigue el mismo error.
¿a alguien le ha ocurrido lo mismo? ¿Cómo lo ha solucionado?
Gracias.
|
|
|
|
|